{"text_format":"1","workbook":"xlsx","n_sheets":5,"sheets":["Validation","MYP","Cash Flow","Payroll","vena.tmp.7EC47338204F4F1F"],"not_rendered":{"charts":0,"images":0,"macros":1,"external_links":0,"defined_names":6099,"comments":0,"pivot_tables":0},"unopened":[],"bounds":{"document_bytes":16777216,"sheet_cells":100000,"rows_first":2000,"rows_last":500,"rows_between":2000,"halvings":0,"cell_chars":16384,"cell_head_chars":4096},"cells_cut":0,"cells_raw":0,"read":"whole","date_system":"1900"}

{"sheet":"Validation","index":0,"n_rows":7,"n_cols":2,"rows_kept":7,"cut":false,"hidden":true,"merged":[]}
[{"$f":"IF(MYP!#REF!=NoSaveAfterMacro,TRUE,FALSE)","v":{"$error":"#REF!"}},"After running the \"Prepare Workbook for External Distribution\" macro, data cannot be saved to Vena.  Save to box and continue working there."]
[{"$f":"ISREF(INDIRECT(\"'MYP'\"&\"!A1\"))","v":true},"One or more template sheets have been deleted from the workbook. Save to box and continue working there."]
[{"$f":"ISREF(INDIRECT(\"'MYP-Multisite'\"&\"!A1\"))","v":false},"One or more template sheets have been deleted from the workbook. Save to box and continue working there."]
[{"$f":"ISREF(INDIRECT(\"'Cash Flow'\"&\"!A1\"))","v":true},"One or more template sheets have been deleted from the workbook. Save to box and continue working there."]
[{"$f":"ISREF(INDIRECT(\"'Payroll'\"&\"!A1\"))","v":true},"One or more template sheets have been deleted from the workbook. Save to box and continue working there."]
[{"$f":"ISREF(INDIRECT(\"'Rates'\"&\"!A1\"))","v":false},"One or more template sheets have been deleted from the workbook. Save to box and continue working there."]
[{"$f":"ISREF(INDIRECT(\"'Graphs'\"&\"!A1\"))","v":false},"One or more template sheets have been deleted from the workbook. Save to box and continue working there."]

{"sheet":"MYP","index":1,"n_rows":599,"n_cols":7,"rows_kept":599,"cut":false,"hidden":false,"merged":[[4,2,5,2]]}
["ARISE High School"]
["Multi-year Projection"]
["As of Apr FY2022"]
[]
[null,null,"Start-up Year","Year 1","Year 2","Year 3","Year 4"]
[null,null,null,"2021-22","2022-23","2023-24","2024-25"]
[]
[]
[]
["SUMMARY"]
["Revenue"]
[null,"LCFF Entitlement",{"$f":"+C108","v":0},{"$f":"+D108","v":4764963},5679404,5984514,6225107]
[null,"Federal Revenue",{"$f":"+C127","v":0},{"$f":"+D127","v":699382.57000000007},670699.39488334837,676072.04778101516,261348.3065366355]
[null,"Other State Revenues",{"$f":"+C154","v":0},{"$f":"+D154","v":1335825.5070223999},1568852.8371872001,1103250.102471035,1017119.289664304]
[null,"Local Revenues",{"$f":"+C236","v":0},{"$f":"+D236","v":737712.46},724745.46,724745.46,724745.46]
[null,"Fundraising and Grants",{"$f":"+C256","v":0},{"$f":"+D256","v":25441},236000,25000,25000]
[null,"Total Revenue",{"$f":"SUM(C12:C16)","v":0},{"$f":"SUM(D12:D16)","v":7563324.5370223997},8879701.6920705475,8513581.6102520488,8253320.0562009392]
[]
["Expenses"]
[null,"Compensation and Benefits",{"$f":"C313+C375+C388","v":0},5161386.8600145802,5768418.7698464217,5656942.7496726448,5702406.070797245]
[null,"Books and Supplies",{"$f":"C451","v":0},{"$f":"D451","v":527174.11},348660.2,355633.40399999998,362746.07208000001]
[null,"Services and Other Operating Expenditures",{"$f":"C577","v":0},{"$f":"D577","v":2003803.8382999997},2433377.1474680002,2099693.61586216,2079779.7441861122]
[null,"Depreciation",{"$f":"C580","v":0},{"$f":"D581","v":45026.380271547299},40176.853955757797,36849.770959806403,35834.611485134803]
[null,"Other Outflows",{"$f":"C597+C581","v":0},{"$f":"D597","v":49606.33},39916.589999999997,41950.422731565697,35308.925857824303]
[null,"Total Expenses",{"$f":"SUM(C20:C24)","v":0},{"$f":"SUM(D20:D24)","v":7786997.518586128},8630549.5612701792,8191069.9632261768,8216075.4244063171]
[]
["Operating Income",null,{"$f":"C17-C25","v":0},{"$f":"D17-D25","v":-223672.9815637283},249152.13080036826,322511.64702587202,37244.631794622168]
[]
["Fund Balance"]
[null,"Beginning Balance (Unaudited)",0,2124854.79,{"$f":"D35","v":1878187.8084362717},{"$f":"E35","v":2127339.93923664},2449851.586262512]
[null,"Audit Adjustment",null,-22994]
[null,"Beginning Balance (Audited)",{"$f":"SUM(C30:C31)","v":0},{"$f":"SUM(D30:D31)","v":2101860.79},1878187.8084362717,2127339.93923664,2449851.586262512]
[null,"Operating Income",{"$f":"+C27","v":0},{"$f":"+D27","v":-223672.9815637283},249152.13080036826,322511.64702587202,37244.631794622168]
[]
["Ending Fund Balance",null,{"$f":"C32+C33","v":0},{"$f":"D32+D33","v":1878187.8084362717},2127339.93923664,2449851.586262512,2487096.2180571342]
[]
["Total Revenue Per ADA",null,null,{"$f":"IFERROR(D17/D$78,\"\")","v":20894.316086585997},22656.924096934443,21722.753649346931,21058.685589408396]
["Total Expenses Per ADA",null,null,{"$f":"IFERROR(D25/D$78,\"\")","v":21512.23139009373},22021.202187360122,20899.851916784486,20963.654379481315]
["Operating Income Per ADA",null,null,{"$f":"IFERROR(D27/D$78,\"\")","v":-617.91530350773053},635.7219095743219,822.90173256244134,95.031209927082486]
["Fund Balance as a % of Expenses",null,{"$f":"IFERROR(C35/C25,\"\")","v":""},0.24119537780169872,0.24648951079351128,0.29908810415014464,0.30271097690620929]
{"$rows_left_out":560}
{"sheet":"Cash Flow","index":2,"n_rows":571,"n_cols":30,"rows_kept":571,"cut":false,"hidden":false,"merged":[[4,2,4,15],[5,2,5,15],[4,16,4,29],[5,16,5,29]]}
["ARISE High School",null,"","","","","","","","","","","","","","","","","","","","","","","","","","","",""]
["Monthly Cash Forecast",null,"","","","","","","","","","","","","","","","","","","","","","","","","","","",""]
["As of Apr FY2022",null,"","","","","","","","","","","","","","","","","","","","","","","","","","","",""]
[]
["","","2021-22",null,null,null,null,null,null,null,null,null,null,null,null,null,"2022-23"]
["","","Actuals & Forecast",null,null,null,null,null,null,null,null,null,null,null,null,null,"Actuals & Forecast"]
["","","Jul","Aug","Sep","Oct","Nov","Dec","Jan","Feb","Mar","Apr","May","Jun","Forecast","Remaining","Jul","Aug","Sep","Oct","Nov","Dec","Jan","Feb","Mar","Apr","May","Jun","Forecast","Remaining"]
["","","Actuals","Actuals","Actuals","Actuals","Actuals","Actuals","Actuals","Actuals","Actuals","Actuals","Forecast","Forecast",null,"Balance","Forecast","Forecast","Forecast","Forecast","Forecast","Forecast","Forecast","Forecast","Forecast","Forecast","Forecast","Forecast",null,"Balance"]
["","",null,null,null,null,null,null,null,null,null,null,null,null,"",""]
["Beginning Cash",null,366989.31,{"$f":"C570","v":962604.0700000003},{"$f":"D570","v":177235.22000000032},{"$f":"E570","v":209074.97000000035},{"$f":"F570","v":390042.63000000041},{"$f":"G570","v":99409.770000000193},{"$f":"H570","v":-168425.34999999986},{"$f":"I570","v":287036.51000000024},{"$f":"J570","v":100299.17000000025},{"$f":"K570","v":38238.140000000203},{"$f":"L570","v":17400.320000000203},{"$f":"M570","v":11002.965076136874},"","",{"$f":"N570","v":107795.3712008514},{"$f":"Q570","v":866592.33174667635},{"$f":"R570","v":717346.73849126208},{"$f":"S570","v":343565.42860678677},{"$f":"T570","v":461732.36569277657},{"$f":"U570","v":184947.98074785521},{"$f":"V570","v":-9261.1507298738579},{"$f":"W570","v":-63516.786123349091},{"$f":"X570","v":-319843.26087490015},{"$f":"Y570","v":-178306.58604508446},{"$f":"Z570","v":94533.979870440438},{"$f":"AA570","v":26347.479047621455},"",""]
["","","","","","","","","","","","","","","","","","","","","","","","","","","","","",""]
["REVENUE",null,"","","","","","","","","","","","","","","","","","","","","","","","","","","",""]
[null,""]
["LCFF Entitlement"]
["",null,null,null,null,null,null,null,null,null,null,null,null,null,null,{"$f":"O15-SUM(C15:N15)","v":0},null,null,null,null,null,null,null,null,null,null,null,null,null,{"$f":"AC15-SUM(Q15:AB15)","v":0}]
[8000,"Revenue",0,0,0,0,0,0,0,0,0,0,0,0,null,{"$f":"O16-SUM(C16:N16)","v":0},null,null,null,null,null,null,null,null,null,null,null,null,null,{"$f":"AC16-SUM(Q16:AB16)","v":0}]
[8010,"Principal Apportionment",0,0,0,0,0,0,0,0,0,0,0,0,null,0,null,null,null,null,null,null,null,null,null,null,null,null,null,0]
[8011,"Charter Schools General Purpose Entitlement - State Aid",0,134238,134238,241629,241629,241629,241629,241629,201710,201710,201710.5,201710.25,2526117,242655.25,0,150334.518577771,150334.518577771,270602.13343998801,270602.13343998801,270602.13343998801,270602.13343998801,270602.13343998801,320339.85912890401,320339.85912890401,320339.85912890401,320339.85912890401,3255379,320339.85912890173]
[8012,"Education Protection Account Entitlement",0,0,0,262400,0,0,262400,0,0,270708,0,0,1212994.68,417486.67999999993,0,0,0,303248.67,0,0,303248.67,0,0,378495.45,0,0,1313323.72,328330.92999999993]
[8018,"Advance Apportionment (clearing acct-shld be zero at yr end",0,0,0,0,0,0,0,0,0,0,0,0,null,0,null,null,null,null,null,null,null,null,null,null,null,null,null,0]
[8019,"State Aid - Prior Years",0,0,0,0,0,-83,0,0,0,0,83,0,0,0,0,0,0,0,0,0,0,0,0,0,0,0,0,0]
[8096,"Charter Schools in Lieu of Property Taxes",0,0,0,267989,82458,82458,82458,82458,160195,80097,22635.186666666799,65731.776666666701,1025851.32,99371.356666666456,0,61551.0792,123102.1584,82068.105599999995,82068.105599999995,82068.105599999995,82068.105599999995,82068.105599999995,171902.5048,85951.252399999998,85951.252399999998,85951.252399999998,1110701.28,85951.252399999998]
[]
["","LCFF Entitlement",{"$f":"SUM(C15:C23)","v":0},134238,134238,772018,324087,324004,586487,324087,361905,552515,224428.68666666679,267442.02666666673,4764963,759513.28666666639,0,211885.59777777101,273436.67697777099,655918.90903998807,352670.23903998802,352670.23903998802,655918.90903998807,352670.23903998802,492242.363928904,784786.56152890401,406291.111528904,406291.111528904,5679404,734622.04152890167]
[]
["Federal Revenue",null,"","","","","","","","","","","","","","","","","","","","","","","","","","","",""]
["",null,null,null,null,null,null,null,null,null,null,null,null,null,null,{"$f":"O27-SUM(C27:N27)","v":0},null,null,null,null,null,null,null,null,null,null,null,null,null,{"$f":"AC27-SUM(Q27:AB27)","v":0}]
[8100,"Federal Revenue",0,0,0,0,0,0,0,0,0,0,0,0,null,{"$f":"O28-SUM(C28:N28)","v":0},null,null,null,null,null,null,null,null,null,null,null,null,null,{"$f":"AC28-SUM(Q28:AB28)","v":0}]
[8181,"Special Education - Entitlement",0,0,0,0,0,0,0,0,0,0,0,0,54029.07,54029.07,0,0,0,0,0,0,0,0,0,0,0,0,55844,55844]
[8182,"Special Education Reimbursement",0,0,0,0,0,0,0,0,0,0,0,0,0,0,0,0,0,0,0,0,0,0,0,0,0,0,0,0]
[8220,"Child Nutrition Programs",0,0,0,0,0,0,12434.46,7087.91,2325.5700000000002,9725.42,3672,3672,36720,-2197.3600000000006,0,0,0,0,2241.4644883348301,2241.4644883348301,2241.4644883348301,2241.4644883348301,2241.4644883348301,2241.4644883348301,2241.4644883348301,2241.4644883348301,22414.644883348301,4482.9289766696602]
[8290,"No Child Left Behind",0,0,0,0,0,0,0,0,0,0,0,0,0,0,0,0,0,0,0,0,0,0,0,0,0,0,0,0]
[8291,"Title I",0,0,0,35687,0,0,66840,0,0,0,27287,0,139873,10059,0,0,0,0,34968.25,0,0,34968.25,0,0,34968.25,0,139873,34968.25]
[8292,"Title II",0,0,0,0,0,0,0,6088,0,0,4854.375,0,19417.5,8475.125,0,0,0,0,5016.1875,0,0,5016.1875,0,0,5016.1875,0,20064.75,5016.1875]
[8293,"Title III",0,0,0,0,0,0,0,0,0,0,1830.5,0,7322,5491.5,0,0,0,0,1830.5,0,0,1830.5,0,0,1830.5,0,7322,1830.5]
[8294,"Title IV",0,0,0,0,0,0,0,0,0,0,2500,0,10000,7500,0,0,0,0,2500,0,0,2500,0,0,2500,0,10000,2500]
[8295,"Title V",0,0,0,0,0,0,0,0,0,0,0,0,0,0,0,0,0,0,0,0,0,0,0,0,0,0,0,0]
[8296,"Other Federal Revenue",0,0,0,0,0,0,0,0,0,0,0,0,0,0,0,0,0,0,0,0,0,0,0,0,0,0,0,0]
[8297,"PY Federal - Not Accrued",0,0,0,0,193,0,0,0,-5353,0,0,0,-5160,0,0,0,0,0,0,0,0,0,0,0,0,0,0,0]
[8298,"Implementation Grant",0,0,0,0,0,0,0,0,0,0,0,0,0,0,0,0,0,0,0,0,0,0,0,0,0,0,0,0]
{"$rows_left_out":532}
{"sheet":"Payroll","index":3,"n_rows":242,"n_cols":49,"rows_kept":242,"cut":false,"hidden":false,"merged":[[4,0,6,4],[5,47,5,48],[4,6,4,14],[4,16,4,24],[4,26,4,34],[4,36,4,44],[4,47,4,48],[5,6,5,14],[5,16,5,24],[5,26,5,34],[5,36,5,44],[6,47,6,48],[6,6,6,9],[6,11,6,14],[6,41,6,44],[6,16,6,19],[6,21,6,24],[6,26,6,29],[6,31,6,34],[6,36,6,39]]}
["ARISE High School"]
["2021-22"]
["As of Apr FY2022"]
[]
["Payroll",null,null,null,null,null,"Year 1",null,null,null,null,null,null,null,null,null,"Year 2",null,null,null,null,null,null,null,null,null,"Year 3",null,null,null,null,null,null,null,null,null,"Year 4",null,null,null,null,null,null,null,null,null,"Year 5"]
[null,null,null,null,null,null,"2021-22",null,null,null,null,null,null,null,null,null,"2022-23",null,null,null,null,null,null,null,null,null,"2023-24",null,null,null,null,null,null,null,null,null,"2024-25",null,null,null,null,null,null,null,null,null,"2025-26"]
[null,null,null,null,null,null,"Total Paid",null,null,null,null,"FTE Count",null,null,null,null,"Total Paid",null,null,null,null,"FTE Count",null,null,null,null,"Total Paid",null,null,null,null,"FTE Count",null,null,null,null,"Total Paid",null,null,null,null,"FTE Count",null,null,null,null,"Total Paid"]
["Head Count","Last Name","First Name","Position Name","Budget Category",null,"Total Paid","Total Paid",null,"Total",null,"FTE Count","FTE Count",null,"Total",null,"Total Paid","Total Paid",null,"Total",null,"FTE Count","FTE Count",null,"Total",null,"Total Paid","Total Paid",null,"Total",null,"FTE Count","FTE Count",null,"Total",null,"Total Paid","Total Paid",null,"Total",null,"FTE Count","FTE Count",null,"Total",null,"Total Paid",null,"Total"]
["Click here and insert LID"]
[1,"Aguilar","Armando","Custodian",2930,null,null,11378.2991202346,null,{"$f":"SUM(G10:I10)","v":11378.2991202346},null,null,0.28445747800586502,null,{"$f":"SUM(L10:N10)","v":0.28445747800586502},null,null,0,null,{"$f":"SUM(Q10:S10)","v":0},null,null,0,null,{"$f":"SUM(V10:X10)","v":0},null,null,0,null,{"$f":"SUM(AA10:AC10)","v":0},null,null,0,null,{"$f":"SUM(AF10:AH10)","v":0},null,null,0,null,{"$f":"SUM(AK10:AM10)","v":0},null,null,0,null,{"$f":"SUM(AP10:AR10)","v":0},null,null,null,{"$f":"SUM(AV10:AV10)","v":0}]
[1,"Ahmed","Hiba","Dean of Language",1100,null,null,70148,null,70148,null,null,1,null,1,null,null,93021,null,93021,null,null,1,null,1,null,null,95811.63,null,95811.63,null,null,1,null,1,null,null,98685.978900000002,null,98685.978900000002,null,null,1,null,1,null,null,null,{"$f":"SUM(AV11:AV11)","v":0}]
[1,"Albert","Brittany","12th Grade Academic Counselor",2200,null,null,58500,null,58500,null,null,1,null,1,null,null,65800,null,65800,null,null,1,null,1,null,null,67774,null,67774,null,null,1,null,1,null,null,69807.22,null,69807.22,null,null,1,null,1,null,null,null,{"$f":"SUM(AV12:AV12)","v":0}]
[1,"Alvarez","Martha","Science Teacher",1100,null,null,58075,null,58075,null,null,1,null,1,null,null,71569,null,71569,null,null,1,null,1,null,null,73716.070000000007,null,73716.070000000007,null,null,1,null,1,null,null,75927.552100000001,null,75927.552100000001,null,null,1,null,1,null,null,null,{"$f":"SUM(AV13:AV13)","v":0}]
[1,"Arrellano","Martha Dias de","Breakfast Coordinator",2928,null,null,21600,null,21600,null,null,0.5,null,0.5,null,null,17304,null,17304,null,null,0.375,null,0.375,null,null,17823.12,null,17823.12,null,null,0.375,null,0.375,null,null,18357.813600000001,null,18357.813600000001,null,null,0.375,null,0.375,null,null,null,{"$f":"SUM(AV14:AV14)","v":0}]
[1,"Arrellano","Martha Dias de","Custodian",2930,null,null,32400,null,32400,null,null,0.75,null,0.75,null,null,0,null,0,null,null,0,null,0,null,null,0,null,0,null,null,0,null,0,null,null,0,null,0,null,null,0,null,0,null,null,null,{"$f":"SUM(AV15:AV15)","v":0}]
[1,"Arrellano","Martha Diaz de","Admin Assistant",2200,null,null,0,null,0,null,null,0,null,0,null,null,37192,null,37192,null,null,1,null,1,null,null,38307.760000000002,null,38307.760000000002,null,null,1,null,1,null,null,39456.9928,null,39456.9928,null,null,1,null,1,null,null,null,{"$f":"SUM(AV16:AV16)","v":0}]
[1,"Bata","Gabriella","Electives Teacher",1100,null,null,86000,null,86000,null,null,1,null,1,null,null,0,null,0,null,null,0,null,0,null,null,0,null,0,null,null,0,null,0,null,null,0,null,0,null,null,0,null,0,null,null,null,{"$f":"SUM(AV17:AV17)","v":0}]
[1,"Bermudez","Katherine","9th Grade Academic Counselor",2200,null,null,58000,null,58000,null,null,1,null,1,null,null,69285,null,69285,null,null,1,null,1,null,null,71363.55,null,71363.55,null,null,1,null,1,null,null,73504.4565,null,73504.4565,null,null,1,null,1,null,null,null,{"$f":"SUM(AV18:AV18)","v":0}]
[1,"Caplan","Arianna","Dean of School Culture",1300,null,null,93254,null,93254,null,null,1,null,1,null,null,104619,null,104619,null,null,1,null,1,null,null,107757.57,null,107757.57,null,null,1,null,1,null,null,110990.2971,null,110990.2971,null,null,1,null,1,null,null,null,{"$f":"SUM(AV19:AV19)","v":0}]
[1,"Carrasco-Zanini","Emiliano","Spanish",1100,null,null,80134,null,80134,null,null,1,null,1,null,null,0,null,0,null,null,0,null,0,null,null,0,null,0,null,null,0,null,0,null,null,0,null,0,null,null,0,null,0,null,null,null,{"$f":"SUM(AV20:AV20)","v":0}]
[1,"Castro","Armando","PE/RSP Teacher",1148,null,null,69794.721407624704,null,69794.721407624704,null,null,0.99706744868035202,null,0.99706744868035202,null,null,77465,null,77465,null,null,1,null,1,null,null,79788.95,null,79788.95,null,null,1,null,1,null,null,82182.618499999997,null,82182.618499999997,null,null,1,null,1,null,null,null,{"$f":"SUM(AV21:AV21)","v":0}]
[1,"Cervantes","Oscar","Soccer Coach",2100,null,null,15000,null,15000,null,null,0.25,null,0.25,null,null,0,null,0,null,null,0,null,0,null,null,0,null,0,null,null,0,null,0,null,null,0,null,0,null,null,0,null,0,null,null,null,{"$f":"SUM(AV22:AV22)","v":0}]
[1,"Collignon","Robyn","Director of SPED",1148,null,null,95469,null,95469,null,null,1,null,1,null,null,99910,null,99910,null,null,1,null,1,null,null,102907.3,null,102907.3,null,null,1,null,1,null,null,105994.519,null,105994.519,null,null,1,null,1,null,null,null,{"$f":"SUM(AV23:AV23)","v":0}]
[1,"Doan","Thy","Math",1100,null,null,76179,null,76179,null,null,1,null,1,null,null,0,null,0,null,null,0,null,0,null,null,0,null,0,null,null,0,null,0,null,null,0,null,0,null,null,0,null,0,null,null,null,{"$f":"SUM(AV24:AV24)","v":0}]
[1,"Figueroa","Adalberto","Student Enrichment Director ",1200,null,null,60769.444444444503,null,60769.444444444503,null,null,0.92777777777777803,null,0.92777777777777803,null,null,0,null,0,null,null,0,null,0,null,null,0,null,0,null,null,0,null,0,null,null,0,null,0,null,null,0,null,0,null,null,null,{"$f":"SUM(AV25:AV25)","v":0}]
[1,"Fully","Melissa","Dean of Literacy",1200,null,null,84450,null,84450,null,null,1,null,1,null,null,105354,null,105354,null,null,1,null,1,null,null,108514.62,null,108514.62,null,null,1,null,1,null,null,111770.0586,null,111770.0586,null,null,1,null,1,null,null,null,{"$f":"SUM(AV26:AV26)","v":0}]
[1,"Gandiaga","Karla","Head of School",1300,null,null,159393,null,159393,null,null,1,null,1,null,null,180000,null,180000,null,null,1,null,1,null,null,185400,null,185400,null,null,1,null,1,null,null,190962,null,190962,null,null,1,null,1,null,null,null,{"$f":"SUM(AV27:AV27)","v":0}]
[1,"Gardner","Trevor","Director of Teaching and Learning",1300,null,null,107236,null,107236,null,null,1,null,1,null,null,119274,null,119274,null,null,1,null,1,null,null,122852.22,null,122852.22,null,null,1,null,1,null,null,126537.78660000001,null,126537.78660000001,null,null,1,null,1,null,null,null,{"$f":"SUM(AV28:AV28)","v":0}]
[1,"Gerosa","Jennifer","English Teacher",1100,null,null,0,null,0,null,null,0,null,0,null,null,79571,null,79571,null,null,1,null,1,null,null,81958.13,null,81958.13,null,null,1,null,1,null,null,84416.873900000006,null,84416.873900000006,null,null,1,null,1,null,null,null,{"$f":"SUM(AV29:AV29)","v":0}]
[1,"Henion","Zoe","Health",1100,null,null,0,null,0,null,null,0,null,0,null,null,81286,null,81286,null,null,1,null,1,null,null,83724.58,null,83724.58,null,null,1,null,1,null,null,86236.3174,null,86236.3174,null,null,1,null,1,null,null,null,{"$f":"SUM(AV30:AV30)","v":0}]
[1,"Hernandez","Jeanette","Academic Counselor",1148,null,null,39985.873655914002,null,39985.873655914002,null,null,0.76120071684587798,null,0.76120071684587798,null,null,55075,null,55075,null,null,1,null,1,null,null,56727.25,null,56727.25,null,null,1,null,1,null,null,58429.067499999997,null,58429.067499999997,null,null,1,null,1,null,null,null,{"$f":"SUM(AV31:AV31)","v":0}]
[1,"Hernandez","Natalie","College and Career Counselor",2200,null,null,35020,null,35020,null,null,0.5,null,0.5,null,null,0,null,0,null,null,0,null,0,null,null,0,null,0,null,null,0,null,0,null,null,0,null,0,null,null,0,null,0,null,null,null,{"$f":"SUM(AV32:AV32)","v":0}]
[1,"Hubl","Mallory","CTE Science Teacher",1100,null,null,72500,null,72500,null,null,1,null,1,null,null,85601,null,85601,null,null,1,null,1,null,null,88169.03,null,88169.03,null,null,1,null,1,null,null,90814.100900000005,null,90814.100900000005,null,null,1,null,1,null,null,null,{"$f":"SUM(AV33:AV33)","v":0}]
[1,"Iglesias","Melissa","Attendance and Student Engagement Coordinator",2400,null,null,0,null,0,null,null,0,null,0,null,null,62830,null,62830,null,null,1,null,1,null,null,64714.9,null,64714.9,null,null,1,null,1,null,null,66656.346999999994,null,66656.346999999994,null,null,1,null,1,null,null,null,{"$f":"SUM(AV34:AV34)","v":0}]
[1,"Iniguez","Elvira","Business and Ops Manager",2300,null,null,90375,null,90375,null,null,1,null,1,null,null,0,null,0,null,null,0,null,0,null,null,0,null,0,null,null,0,null,0,null,null,0,null,0,null,null,0,null,0,null,null,null,{"$f":"SUM(AV35:AV35)","v":0}]
[1,"Johnson","Summer","CTE Intermediate Public and Community Health and Chemistry Teacher",1100,null,null,0,null,0,null,null,0,null,0,null,null,68286,null,68286,null,null,1,null,1,null,null,70334.58,null,70334.58,null,null,1,null,1,null,null,72444.617400000003,null,72444.617400000003,null,null,1,null,1,null,null,null,{"$f":"SUM(AV36:AV36)","v":0}]
[1,"Kahn","Gabriel","Teacher - Statistics",1100,null,null,65920,null,65920,null,null,1,null,1,null,null,73645,null,73645,null,null,1,null,1,null,null,75854.350000000006,null,75854.350000000006,null,null,1,null,1,null,null,78129.980500000005,null,78129.980500000005,null,null,1,null,1,null,null,null,{"$f":"SUM(AV37:AV37)","v":0}]
[1,"Kurzfeld","Gena","Math",1100,null,null,108041,null,108041,null,null,1,null,1,null,null,0,null,0,null,null,0,null,0,null,null,0,null,0,null,null,0,null,0,null,null,0,null,0,null,null,0,null,0,null,null,null,{"$f":"SUM(AV38:AV38)","v":0}]
[1,"Lay","Rubys","Math Teacher",1100,null,null,85380,null,85380,null,null,1,null,1,null,null,93250,null,93250,null,null,1,null,1,null,null,96047.5,null,96047.5,null,null,1,null,1,null,null,98928.925000000003,null,98928.925000000003,null,null,1,null,1,null,null,null,{"$f":"SUM(AV39:AV39)","v":0}]
[1,"Leindecker","Dana","Data Coordinator",1900,null,null,15579,null,15579,null,null,0.25,null,0.25,null,null,0,null,0,null,null,0,null,0,null,null,0,null,0,null,null,0,null,0,null,null,0,null,0,null,null,0,null,0,null,null,null,{"$f":"SUM(AV40:AV40)","v":0}]
{"$rows_left_out":203}
{"sheet":"vena.tmp.7EC47338204F4F1F","index":4,"n_rows":0,"n_cols":0,"rows_kept":0,"cut":false,"hidden":true,"merged":[]}