{"text_format":"1","workbook":"xlsx","n_sheets":3,"sheets":["Validation","Cash Flow","vena.tmp.7EC47338204F4F1F"],"not_rendered":{"charts":0,"images":0,"macros":1,"external_links":0,"defined_names":6253,"comments":0,"pivot_tables":0},"unopened":[],"bounds":{"document_bytes":16777216,"sheet_cells":100000,"rows_first":2000,"rows_last":500,"rows_between":2000,"halvings":0,"cell_chars":16384,"cell_head_chars":4096},"cells_cut":0,"cells_raw":0,"read":"whole","date_system":"1900"}

{"sheet":"Validation","index":0,"n_rows":7,"n_cols":2,"rows_kept":7,"cut":false,"hidden":true,"merged":[]}
[{"$f":"IF(#REF!=NoSaveAfterMacro,TRUE,FALSE)","v":{"$error":"#REF!"}},"After running the \"Prepare Workbook for External Distribution\" macro, data cannot be saved to Vena.  Save to box and continue working there."]
[{"$f":"ISREF(INDIRECT(\"'MYP'\"&\"!A1\"))","v":false},"One or more template sheets have been deleted from the workbook. Save to box and continue working there."]
[{"$f":"ISREF(INDIRECT(\"'MYP-Multisite'\"&\"!A1\"))","v":false},"One or more template sheets have been deleted from the workbook. Save to box and continue working there."]
[{"$f":"ISREF(INDIRECT(\"'Cash Flow'\"&\"!A1\"))","v":true},"One or more template sheets have been deleted from the workbook. Save to box and continue working there."]
[{"$f":"ISREF(INDIRECT(\"'Payroll'\"&\"!A1\"))","v":false},"One or more template sheets have been deleted from the workbook. Save to box and continue working there."]
[{"$f":"ISREF(INDIRECT(\"'Rates'\"&\"!A1\"))","v":false},"One or more template sheets have been deleted from the workbook. Save to box and continue working there."]
[{"$f":"ISREF(INDIRECT(\"'Graphs'\"&\"!A1\"))","v":false},"One or more template sheets have been deleted from the workbook. Save to box and continue working there."]

{"sheet":"Cash Flow","index":1,"n_rows":588,"n_cols":86,"rows_kept":588,"cut":false,"hidden":false,"merged":[[4,2,4,15],[5,2,5,15],[4,16,4,29],[5,16,5,29],[4,30,4,43],[5,30,5,43],[4,44,4,57],[5,44,5,57],[4,58,4,71],[5,58,5,71],[4,72,4,85],[5,72,5,85]]}
["Urban Montessori",null,"","","","","","","","","","","","","","","","","","","","","","","","","","","","","","","","","","","","","","","","","","","","","","","","","","","","","","","","","","","","","","","","","","","","","","","","","","","","","","","","","","","",""]
["Monthly Cash Forecast",null,"","","","","","","","","","","","","","","","","","","","","","","","","","","","","","","","","","","","","","","","","","","","","","","","","","","","","","","","","","","","","","","","","","","","","","","","","","","","","","","","","","","",""]
[null,null,"","","","","","","","","","","","","","","","","","","","","","","","","","","","","","","","","","","","","","","","","","","","","","","","","","","","","","","","","","","","","","","","","","","","","","","","","","","","","","","","","","","",""]
[]
["","","2024-25",null,null,null,null,null,null,null,null,null,null,null,null,null,"2025-26",null,null,null,null,null,null,null,null,null,null,null,null,null,"2026-27",null,null,null,null,null,null,null,null,null,null,null,null,null,"2027-28",null,null,null,null,null,null,null,null,null,null,null,null,null,"2028-29",null,null,null,null,null,null,null,null,null,null,null,null,null,"2029-30"]
["","","Actuals & Forecast",null,null,null,null,null,null,null,null,null,null,null,null,null,"Actuals & Forecast",null,null,null,null,null,null,null,null,null,null,null,null,null,"Actuals & Forecast",null,null,null,null,null,null,null,null,null,null,null,null,null,"Actuals & Forecast",null,null,null,null,null,null,null,null,null,null,null,null,null,"Actuals & Forecast",null,null,null,null,null,null,null,null,null,null,null,null,null,"Actuals & Forecast"]
["","","Jul","Aug","Sep","Oct","Nov","Dec","Jan","Feb","Mar","Apr","May","Jun","Forecast","Remaining","Jul","Aug","Sep","Oct","Nov","Dec","Jan","Feb","Mar","Apr","May","Jun","Forecast","Remaining","Jul","Aug","Sep","Oct","Nov","Dec","Jan","Feb","Mar","Apr","May","Jun","Forecast","Remaining","Jul","Aug","Sep","Oct","Nov","Dec","Jan","Feb","Mar","Apr","May","Jun","Forecast","Remaining","Jul","Aug","Sep","Oct","Nov","Dec","Jan","Feb","Mar","Apr","May","Jun","Forecast","Remaining","Jul","Aug","Sep","Oct","Nov","Dec","Jan","Feb","Mar","Apr","May","Jun","Forecast","Remaining"]
["","","Forecast","Forecast","Forecast","Forecast","Forecast","Forecast","Forecast","Forecast","Forecast","Forecast","Forecast","Forecast",null,"Balance","Forecast","Forecast","Forecast","Forecast","Forecast","Forecast","Forecast","Forecast","Forecast","Forecast","Forecast","Forecast",null,"Balance","Forecast","Forecast","Forecast","Forecast","Forecast","Forecast","Forecast","Forecast","Forecast","Forecast","Forecast","Forecast",null,"Balance","Forecast","Forecast","Forecast","Forecast","Forecast","Forecast","Forecast","Forecast","Forecast","Forecast","Forecast","Forecast",null,"Balance","Forecast","Forecast","Forecast","Forecast","Forecast","Forecast","Forecast","Forecast","Forecast","Forecast","Forecast","Forecast",null,"Balance","Forecast","Forecast","Forecast","Forecast","Forecast","Forecast","Forecast","Forecast","Forecast","Forecast","Forecast","Forecast",null,"Balance"]
["","",null,null,null,null,null,null,null,null,null,null,null,null,"",""]
["Beginning Cash",null,1807456.6,{"$f":"C587","v":2461385.0779292607},{"$f":"D587","v":2222807.4352397248},{"$f":"E587","v":2109403.9931220966},{"$f":"F587","v":2164422.7075352152},{"$f":"G587","v":2068461.0878987703},{"$f":"H587","v":2005055.5090923328},{"$f":"I587","v":2070772.1265646678},{"$f":"J587","v":1990690.0106891082},{"$f":"K587","v":2094131.1381968944},{"$f":"L587","v":2225029.9324840363},{"$f":"M587","v":2162796.3677951023},"","",{"$f":"N587","v":1921323.7710488208},{"$f":"Q587","v":2213680.4673610264},{"$f":"R587","v":1962667.8824454336},{"$f":"S587","v":1744539.7492500644},{"$f":"T587","v":1699601.3368621073},{"$f":"U587","v":1602003.5743671998},{"$f":"V587","v":1443715.3868430562},{"$f":"W587","v":1516188.1497015648},{"$f":"X587","v":1437682.4107503647},{"$f":"Y587","v":1492096.5665886551},{"$f":"Z587","v":1696709.0145926077},{"$f":"AA587","v":1665489.9382116178},"","",{"$f":"AB587","v":1713630.1250927204},{"$f":"AE587","v":2081943.4928564602},{"$f":"AF587","v":1831708.5967954348},{"$f":"AG587","v":1603974.4754632672},{"$f":"AH587","v":1581133.8792593353},{"$f":"AI587","v":1502078.1185819164},{"$f":"AJ587","v":1344556.7051738398},{"$f":"AK587","v":1458778.5550252427},{"$f":"AL587","v":1401322.0684719775},{"$f":"AM587","v":1436061.4549756064},{"$f":"AN587","v":1643478.2747610761},{"$f":"AO587","v":1609824.3073804346},"","",{"$f":"AP587","v":1607214.2472078858},{"$f":"AS587","v":2003248.6552507472},{"$f":"AT587","v":1758000.4787652055},{"$f":"AU587","v":1538340.3053761637},{"$f":"AV587","v":1542363.3724455312},{"$f":"AW587","v":1482829.0945976221},{"$f":"AX587","v":1342819.4015631678},{"$f":"AY587","v":1494403.3038501507},{"$f":"AZ587","v":1458143.8788623265},{"$f":"BA587","v":1461648.8770393501},{"$f":"BB587","v":1635966.8122234265},{"$f":"BC587","v":1579716.4891769681},"","",{"$f":"BD587","v":1731317.2210593557},{"$f":"BG587","v":2113774.2313279146},{"$f":"BH587","v":1859801.3496350972},{"$f":"BI587","v":1630147.7891114054},{"$f":"BJ587","v":1632974.2877575266},{"$f":"BK587","v":1571443.1646678615},{"$f":"BL587","v":1427112.6531952266},{"$f":"BM587","v":1584308.2690925002},{"$f":"BN587","v":1546325.3322724209},{"$f":"BO587","v":1544482.8448134847},{"$f":"BP587","v":1721826.4678443489},{"$f":"BQ587","v":1660439.0642288001},"","",{"$f":"BR587","v":1808236.0900289449},{"$f":"BU587","v":2199964.4559463719},{"$f":"BV587","v":1929679.1269335516},{"$f":"BW587","v":1682243.149677132},{"$f":"BX587","v":1671781.7828249265},{"$f":"BY587","v":1594936.522390021},{"$f":"BZ587","v":1433781.1987765103},{"$f":"CA587","v":1582778.8164741364},{"$f":"CB587","v":1529690.929283937},{"$f":"CC587","v":1508737.8354905578},{"$f":"CD587","v":1655174.7610168788},{"$f":"CE587","v":1574961.7819912096},"",""]
["","","","","","","","","","","","","","","","","","","","","","","","","","","","","","","","","","","","","","","","","","","","","","","","","","","","","","","","","","","","","","","","","","","","","","","","","","","","","","","","","","","","","",""]
["REVENUE",null,"","","","","","","","","","","","","","","","","","","","","","","","","","","","","","","","","","","","","","","","","","","","","","","","","","","","","","","","","","","","","","","","","","","","","","","","","","","","","","","","","","","",""]
[null,""]
["LCFF Entitlement"]
["",null,null,null,null,null,null,null,null,null,null,null,null,null,null,{"$f":"O15-SUM(C15:N15)","v":0},null,null,null,null,null,null,null,null,null,null,null,null,null,{"$f":"AC15-SUM(Q15:AB15)","v":0},null,null,null,null,null,null,null,null,null,null,null,null,null,{"$f":"AQ15-SUM(AE15:AP15)","v":0},null,null,null,null,null,null,null,null,null,null,null,null,null,{"$f":"BE15-SUM(AS15:BD15)","v":0},null,null,null,null,null,null,null,null,null,null,null,null,null,{"$f":"BS15-SUM(BG15:BR15)","v":0},null,null,null,null,null,null,null,null,null,null,null,null,null,{"$f":"CG15-SUM(BU15:CF15)","v":0}]
[8000,"Revenue",0,0,0,0,0,0,0,0,0,0,0,0,null,{"$f":"O16-SUM(C16:N16)","v":0},null,null,null,null,null,null,null,null,null,null,null,null,null,{"$f":"AC16-SUM(Q16:AB16)","v":0},null,null,null,null,null,null,null,null,null,null,null,null,null,{"$f":"AQ16-SUM(AE16:AP16)","v":0},null,null,null,null,null,null,null,null,null,null,null,null,null,{"$f":"BE16-SUM(AS16:BD16)","v":0},null,null,null,null,null,null,null,null,null,null,null,null,null,{"$f":"BS16-SUM(BG16:BR16)","v":0},null,null,null,null,null,null,null,null,null,null,null,null,null,{"$f":"CG16-SUM(BU16:CF16)","v":0}]
[8010,"Principal Apportionment",0,0,0,0,0,0,0,0,0,0,0,0,null,0,null,null,null,null,null,null,null,null,null,null,null,null,null,0,null,null,null,null,null,null,null,null,null,null,null,null,null,0,null,null,null,null,null,null,null,null,null,null,null,null,null,0,null,null,null,null,null,null,null,null,null,null,null,null,null,0,null,null,null,null,null,null,null,null,null,null,null,null,null,0]
[8011,"Charter Schools General Purpose Entitlement - State Aid",0,100167.55,100167.55,180301.59,180301.59,180301.59,180301.59,180301.59,211276.05544399199,211276.05544399199,211276.05544399199,211276.05544399199,2158223.3272199598,211276.05544399214,0,114253.74595774899,114253.74595774899,205656.74272394701,205656.74272394701,205656.74272394701,205656.74272394701,205656.74272394701,251187.43080285899,251187.43080285899,251187.43080285899,251187.43080285899,2512720.2735695299,251179.34482286125,0,130668.98392959101,130668.98392959101,235204.17107326401,235204.17107326401,235204.17107326401,235204.17107326401,235204.17107326401,265816.18339107098,265816.18339107098,265816.18339107098,265816.18339107098,2766454.8546028002,265831.29781301459,0,145005.11615366599,145005.11615366599,261009.209076598,261009.209076598,261009.209076598,261009.209076598,261009.209076598,263778.69532106601,263778.69532106601,263778.69532106601,263778.69532106601,2913978.4107435201,263807.35176893417,0,152383.787319086,152383.787319086,274290.81717435399,274290.81717435399,274290.81717435399,274290.81717435399,274290.81717435399,275735.99487871601,275735.99487871601,275735.99487871601,275735.99487871601,3054932.1172064301,275766.47718162416,0,152737.10586032199,152737.10586032199,274926.79054857901,274926.79054857901,274926.79054857901,274926.79054857901,274926.79054857901,274920.69408799702,274920.69408799702,274920.69408799702,274920.69408799702,3054742.1172064301,274951.1763909026]
[8012,"Education Protection Account Entitlement",0,0,0,146694.75,0,0,146694.75,0,0,168447.90148502801,0,0,615783.20198003796,153945.80049500999,0,0,0,153945.800495009,0,0,153945.800495009,0,0,214835.27540783101,0,0,696969.16853046604,174242.29213261703,0,0,0,174242.292132617,0,0,174242.292132617,0,0,221903.22213266799,0,0,760517.07519720204,190129.26879930007,0,0,0,190129.268799301,0,0,190129.268799301,0,0,211771.063343763,0,0,789372.80125648598,197343.20031412097,0,0,0,197343.200314121,0,0,197343.200314121,0,0,218277.09879193699,0,0,817284.66589357296,204321.16647339391,0,0,0,204321.16647339301,0,0,204321.16647339301,0,0,204321.16647339301,0,0,817284.66589357296,204321.16647339391]
[8018,"Advance Apportionment (clearing acct-shld be zero at yr end",0,0,0,0,0,0,0,0,0,0,0,0,null,0,null,null,null,null,null,null,null,null,null,null,null,null,null,0,null,null,null,null,null,null,null,null,null,null,null,null,null,0,null,null,null,null,null,null,null,null,null,null,null,null,null,0,null,null,null,null,null,null,null,null,null,null,null,null,null,0,null,null,null,null,null,null,null,null,null,null,null,null,null,0]
[8019,"State Aid - Prior Years",0,0,0,0,0,0,0,0,0,0,0,0,0,0,0,0,0,0,0,0,0,0,0,0,0,0,0,0,0,0,0,0,0,0,0,0,0,0,0,0,0,0,0,0,0,0,0,0,0,0,0,0,0,0,0,0,0,0,0,0,0,0,0,0,0,0,0,0,0,0,0,0,0,0,0,0,0,0,0,0,0,0,0,0]
[8096,"Charter Schools in Lieu of Property Taxes",0,70584.600000000006,141169.20000000001,94112.8,94112.8,94112.8,94112.8,94112.8,184080.71693333299,92040.358466666701,92040.358466666701,92040.358466666701,1234559.9508,92040.35846666689,0,74073.597047999996,148147.19409599999,98764.796063999995,98764.796063999995,98764.796063999995,98764.796063999995,98764.796063999995,213835.12881200001,106917.564406,106917.564406,106917.564406,1357550.1579,106917.56440599984,0,81453.009474000006,162906.01894800001,108604.012632,108604.012632,108604.012632,108604.012632,108604.012632,216562.576206,108281.288103,108281.288103,108281.288103,1437066.8202,108281.2881029998,0,86224.009212000004,172448.01842400001,114965.34561600001,114965.34561600001,114965.34561600001,114965.34561600001,114965.34561600001,203481.32742799999,101740.66371399999,101740.66371399999,101740.66371399999,1443942.7379999999,101740.66371399979,0,86636.564280000006,173273.12856000001,115515.41903999999,115515.41903999999,115515.41903999999,115515.41903999999,115515.41903999999,203297.96961999999,101648.98480999999,101648.98480999999,101648.98480999999,1447380.6969000001,101648.98481000005,0,86842.841813999999,173685.683628,115790.45575199999,115790.45575199999,115790.45575199999,115790.45575199999,115790.45575199999,202633.29756599999,101316.648783,101316.648783,101316.648783,1447380.6969000001,101316.64878300019]
[]
["","LCFF Entitlement",{"$f":"SUM(C15:C23)","v":0},170752.15000000002,241336.75,421109.13999999996,274414.39,274414.39,421109.13999999996,274414.39,395356.77237732499,471764.31539568672,303316.41391065868,303316.41391065868,4008566.4799999977,457262.21440566902,0,188327.34300574899,262400.94005374901,458367.33928295597,304421.53878794704,304421.53878794704,458367.33928295597,304421.53878794704,465022.559614859,572940.27061668993,358104.99520885898,358104.99520885898,4567239.5999999959,532339.20136147807,0,212121.99340359101,293575.002877591,518050.47583788098,{"$f":"SUM(AI15:AI23)","v":343808.183705264},343808.183705264,518050.47583788098,343808.183705264,482378.75959707098,596000.69362673897,374097.47149407095,374097.47149407095,4964038.7500000019,564241.85471531446,0,231229.125365666,317453.134577666,566103.82349189906,375974.554692598,375974.554692598,566103.82349189906,375974.554692598,467260.022749066,577290.42237882898,365519.35903506598,365519.35903506598,5147293.9500000058,562891.21579705493,0,239020.35159908602,325656.91587908601,587149.43652847491,389806.23621435399,389806.23621435399,587149.43652847491,389806.23621435399,{"$f":"SUM(BO15:BO23)","v":479033.964498716},595662.078480653,377384.979688716,377384.979688716,5319597.4800000032,581736.62846501812,0,239579.947674322,326422.78948832199,595038.41277397203,390717.24630057899,390717.24630057899,595038.41277397203,390717.24630057899,477553.99165399699,580558.50934439001,376237.34287099703,376237.34287099703,5319407.4800000032,580588.9916472967]
[]
["Federal Revenue",null,"","","","","","","","","","","","","","","","","","","","","","","","","","","","","","","","","","","","","","","","","","","","","","","","","","","","","","","","","","","","","","","","","","","","","","","","","","","","","","","","","","","",""]
["",null,null,null,null,null,null,null,null,null,null,null,null,null,null,{"$f":"O27-SUM(C27:N27)","v":0},null,null,null,null,null,null,null,null,null,null,null,null,null,{"$f":"AC27-SUM(Q27:AB27)","v":0},null,null,null,null,null,null,null,null,null,null,null,null,null,{"$f":"AQ27-SUM(AE27:AP27)","v":0},null,null,null,null,null,null,null,null,null,null,null,null,null,{"$f":"BE27-SUM(AS27:BD27)","v":0},null,null,null,null,null,null,null,null,null,null,null,null,null,{"$f":"BS27-SUM(BG27:BR27)","v":0},null,null,null,null,null,null,null,null,null,null,null,null,null,{"$f":"CG27-SUM(BU27:CF27)","v":0}]
[8100,"Federal Revenue",0,0,0,0,0,0,0,0,0,0,0,0,null,{"$f":"O28-SUM(C28:N28)","v":0},null,null,null,null,null,null,null,null,null,null,null,null,null,{"$f":"AC28-SUM(Q28:AB28)","v":0},null,null,null,null,null,null,null,null,null,null,null,null,null,{"$f":"AQ28-SUM(AE28:AP28)","v":0},null,null,null,null,null,null,null,null,null,null,null,null,null,{"$f":"BE28-SUM(AS28:BD28)","v":0},null,null,null,null,null,null,null,null,null,null,null,null,null,{"$f":"BS28-SUM(BG28:BR28)","v":0},null,null,null,null,null,null,null,null,null,null,null,null,null,{"$f":"CG28-SUM(BU28:CF28)","v":0}]
[8181,"Special Education - Entitlement",0,0,0,0,0,0,0,0,0,0,0,48580,48580,0,0,0,0,0,0,0,0,0,0,0,0,50820,50820,0,0,0,0,0,0,0,0,0,0,0,0,55580,55580,0,0,0,0,0,0,0,0,0,0,0,0,58520,58520,0,0,0,0,0,0,0,0,0,0,0,0,58800,58800,0,0,0,0,0,0,0,0,0,0,0,0,58940,58940,0]
[8182,"Special Education Reimbursement",0,0,0,0,0,0,0,0,0,0,0,0,0,0,0,0,0,0,0,0,0,0,0,0,0,0,0,0,0,0,0,0,0,0,0,0,0,0,0,0,0,0,0,0,0,0,0,0,0,0,0,0,0,0,0,0,0,0,0,0,0,0,0,0,0,0,0,0,0,0,0,0,0,0,0,0,0,0,0,0,0,0,0,0]
[8220,"Child Nutrition Programs",0,0,0,0,11700.3117594,11700.3117594,11700.3117594,11700.3117594,11700.3117594,11700.3117594,11700.3117594,11700.3117594,117003.117594,23400.623518799999,0,0,0,0,13180.094990457999,13180.094990457999,13180.094990457999,13180.094990457999,13180.094990457999,13180.094990457999,13180.094990457999,13180.094990457999,131800.94990457999,26360.18998091598,0,0,0,0,14293.5972221456,14293.5972221456,14293.5972221456,14293.5972221456,14293.5972221456,14293.5972221456,14293.5972221456,14293.5972221456,142935.972221456,28587.194444291192,0,0,0,0,14792.8472686607,14792.8472686607,14792.8472686607,14792.8472686607,14792.8472686607,14792.8472686607,14792.8472686607,14792.8472686607,147928.47268660701,29585.694537321411,0,0,0,0,15272.9103835937,15272.9103835937,15272.9103835937,15272.9103835937,15272.9103835937,15272.9103835937,15272.9103835937,15272.9103835937,152729.10383593701,30545.820767187412,0,0,0,0,15731.0976951015,15731.0976951015,15731.0976951015,15731.0976951015,15731.0976951015,15731.0976951015,15731.0976951015,15731.0976951015,157310.97695101501,31462.195390202993]
[8290,"ESSER Funds",0,0,0,0,0,0,0,0,0,0,0,0,0,0,0,0,0,0,0,0,0,0,0,0,0,0,0,0,0,0,0,0,0,0,0,0,0,0,0,0,0,0,0,0,0,0,0,0,0,0,0,0,0,0,0,0,0,0,0,0,0,0,0,0,0,0,0,0,0,0,0,0,0,0,0,0,0,0,0,0,0,0,0,0]
[8291,"Title I",0,0,0,0,0,0,33152.8909090909,0,0,0,9534.0545454545299,0,42686.945454545399,0,0,0,0,0,0,0,34810.535454545403,0,0,0,10010.7572727273,0,44821.292727272703,0,0,0,0,0,0,0,38125.824545454503,0,0,0,10964.1627272727,0,49089.987272727201,0,0,0,0,0,0,0,40059.743181818099,0,0,0,11520.315909090899,0,51580.059090909002,0,0,0,0,0,0,0,40336.0172727272,0,0,0,11599.7663636364,0,51935.783636363602,0,0,0,0,0,0,0,40336.0172727272,0,0,0,11599.7663636364,0,51935.783636363602,0]
[8292,"Title II",0,0,0,0,1895.4340909090899,0,0,1895.4340909090899,0,0,1895.4340909090899,0,7581.7363636363698,1895.4340909090997,0,0,0,0,1990.2057954545501,0,0,1990.2057954545501,0,0,1990.2057954545501,0,7960.8231818181903,1990.2057954545398,0,0,0,0,2179.7492045454601,0,0,2179.7492045454601,0,0,2179.7492045454601,0,8718.9968181818203,2179.7492045454401,0,0,0,0,2290.3161931818199,0,0,2290.3161931818199,0,0,2290.3161931818199,0,9161.2647727272797,2290.3161931818195,0,0,0,0,2306.1114772727301,0,0,2306.1114772727301,0,0,2306.1114772727301,0,9224.4459090909095,2306.1114772727196,0,0,0,0,2306.1114772727301,0,0,2306.1114772727301,0,0,2306.1114772727301,0,9224.4459090909095,2306.1114772727196]
[8293,"Title III",0,0,0,0,0,0,0,0,0,0,0,0,0,0,0,0,0,0,0,0,0,0,0,0,0,0,0,0,0,0,0,0,0,0,0,0,0,0,0,0,0,0,0,0,0,0,0,0,0,0,0,0,0,0,0,0,0,0,0,0,0,0,0,0,0,0,0,0,0,0,0,0,0,0,0,0,0,0,0,0,0,0,0,0]
[8294,"Title IV",0,0,0,0,2500,0,0,2500,0,0,2500,0,10000,2500,0,0,0,0,2500,0,0,2500,0,0,2500,0,10000,2500,0,0,0,0,2500,0,0,2500,0,0,2500,0,10000,2500,0,0,0,0,2500,0,0,2500,0,0,2500,0,10000,2500,0,0,0,0,2500,0,0,2500,0,0,2500,0,10000,2500,0,0,0,0,2500,0,0,2500,0,0,2500,0,10000,2500]
[8295,"Title V",0,0,0,0,0,0,0,0,0,0,0,0,0,0,0,0,0,0,0,0,0,0,0,0,0,0,0,0,0,0,0,0,0,0,0,0,0,0,0,0,0,0,0,0,0,0,0,0,0,0,0,0,0,0,0,0,0,0,0,0,0,0,0,0,0,0,0,0,0,0,0,0,0,0,0,0,0,0,0,0,0,0,0,0]
[8296,"Other Federal Revenue",0,0,0,0,0,0,0,0,0,0,0,0,0,0,0,0,0,0,0,0,0,0,0,0,0,0,0,0,0,0,0,0,0,0,0,0,0,0,0,0,0,0,0,0,0,0,0,0,0,0,0,0,0,0,0,0,0,0,0,0,0,0,0,0,0,0,0,0,0,0,0,0,0,0,0,0,0,0,0,0,0,0,0,0]
[8297,"PY Federal - Not Accrued",0,0,0,0,0,0,0,0,0,0,0,0,0,0,0,0,0,0,0,0,0,0,0,0,0,0,0,0,0,0,0,0,0,0,0,0,0,0,0,0,0,0,0,0,0,0,0,0,0,0,0,0,0,0,0,0,0,0,0,0,0,0,0,0,0,0,0,0,0,0,0,0,0,0,0,0,0,0,0,0,0,0,0,0]
[8298,"Implementation Grant",0,0,0,0,0,0,0,0,0,0,0,0,0,0,0,0,0,0,0,0,0,0,0,0,0,0,0,0,0,0,0,0,0,0,0,0,0,0,0,0,0,0,0,0,0,0,0,0,0,0,0,0,0,0,0,0,0,0,0,0,0,0,0,0,0,0,0,0,0,0,0,0,0,0,0,0,0,0,0,0,0,0,0,0]
{"$rows_left_out":549}
{"sheet":"vena.tmp.7EC47338204F4F1F","index":2,"n_rows":0,"n_cols":0,"rows_kept":0,"cut":false,"hidden":true,"merged":[]}